Reaction Details
TargetHeat shock 70 kDa protein 1A
LigandBDBM31695
Substrate/Competitorn/a
Meas. Tech.TR-FRET secondary assay for HTS discovery of chemical inhibitors of Hsp70
IC50>100000±0 nM
Citation PubChem, PC TR-FRET secondary assay for HTS discovery of chemical inhibitors of Hsp70 PubChem Bioassay(2008)[AID]
 
Heat shock 70 kDa protein 1A
Name:Heat shock 70 kDa protein 1A
Type:ATP-binding protein
Mol. Mass.:51937.99
Organism:Homo sapiens (Human)
Description:gi_123271505; GST-tagged ATPase domain
Residue:476
BDBM31695
NameBDBM31695
Synonyms:2-cyano-2-(3-pyrrolidinoquinoxalin-2-yl)acetic acid allyl ester MLS000078749 cid_660535 prop-2-enyl 2-cyano-2-(3-pyrrolidin-1-ylquinoxalin-2-yl)ethanoate
TypeSmall organic molecule
Emp. Form.C18H18N4O2
Mol. Mass.322.3611
SMILESC=CCOC(=O)C(C#N)c1nc2ccccc2nc1N1CCCC1