Reaction Details
TargetComplement C1s subcomponent
LigandBDBM32761
Substrate/Competitorn/a
Meas. Tech.Complement factor C1s IC50 from mixture screen
IC50 11260±2970 nM
Citation PubChem, PC Complement factor C1s IC50 from mixture screen PubChem Bioassay(2008)[AID]
 
Complement C1s subcomponent
Name:Complement C1s subcomponent
Type:Protein
Mol. Mass.:76657.91
Organism:Homo sapiens (Human)
Description:P09871
Residue:688
BDBM32761
NameBDBM32761
Synonyms:2-furancarboxylic acid [5-amino-1-(4-methoxyphenyl)sulfonyl-3-pyrazolyl] ester MLS000033887 US11584714, Compound 40# [5-azanyl-1-(4-methoxyphenyl)sulfonyl-pyrazol-3-yl] furan-2-carboxylate furan-2-carboxylic acid [5-amino-1-(4-methoxyphenyl)sulfonyl-pyrazol-3-yl] ester
TypeSmall organic molecule
Emp. Form.C15H13N3O6S
Mol. Mass.363.345
SMILESCOc1ccc(cc1)S(=O)(=O)n1nc(OC(=O)c2ccco2)cc1N