Reaction Details
TargetComplement C1s subcomponent
LigandBDBM40802
Substrate/Competitorn/a
Meas. Tech.Complement factor C1s IC50 from mixture screen
IC50>50000±0 nM
Citation PubChem, PC Complement factor C1s IC50 from mixture screen PubChem Bioassay(2008)[AID]
 
Complement C1s subcomponent
Name:Complement C1s subcomponent
Type:Protein
Mol. Mass.:76657.91
Organism:Homo sapiens (Human)
Description:P09871
Residue:688
BDBM40802
NameBDBM40802
Synonyms:3-(4-Methyl-piperidine-1-sulfonyl)-N-thiophen-2-ylmethyl-benzamide 3-(4-methylpiperidino)sulfonyl-N-(2-thenyl)benzamide MLS000035040 cid_653928
TypeSmall organic molecule
Emp. Form.C18H22N2O3S2
Mol. Mass.378.509
SMILESCC1CCN(CC1)S(=O)(=O)c1cccc(c1)C(=O)NCc1cccs1