Reaction Details
TargetComplement C1s subcomponent
LigandBDBM40808
Substrate/Competitorn/a
Meas. Tech.Complement factor C1s IC50 from mixture screen
IC50>50000±0 nM
Citation PubChem, PC Complement factor C1s IC50 from mixture screen PubChem Bioassay(2008)[AID]
 
Complement C1s subcomponent
Name:Complement C1s subcomponent
Type:Protein
Mol. Mass.:76657.91
Organism:Homo sapiens (Human)
Description:P09871
Residue:688
BDBM40808
NameBDBM40808
Synonyms:2-(4-Dimethylamino-2-hydroxy-benzoyl)-benzoic acid 2-[4-(dimethylamino)-2-hydroxybenzoyl]benzoic acid 2-[[4-(dimethylamino)-2-hydroxyphenyl]-oxomethyl]benzoic acid SMR000013370 | cid_655619
TypeSmall organic molecule
Emp. Form.C16H15NO4
Mol. Mass.285.2946
SMILESCN(C)c1ccc(C(=O)c2ccccc2C(O)=O)c(O)c1