Reaction Details
TargetComplement C1s subcomponent
LigandBDBM40809
Substrate/Competitorn/a
Meas. Tech.Complement factor C1s IC50 from mixture screen
IC50>50000±0 nM
Citation PubChem, PC Complement factor C1s IC50 from mixture screen PubChem Bioassay(2008)[AID]
 
Complement C1s subcomponent
Name:Complement C1s subcomponent
Type:Protein
Mol. Mass.:76657.91
Organism:Homo sapiens (Human)
Description:P09871
Residue:688
BDBM40809
NameBDBM40809
Synonyms:2-(4-carboxybutanoylamino)benzoic acid 2-[(5-oxidanyl-5-oxidanylidene-pentanoyl)amino]benzoic acid SMR000036462 | cid_657775
TypeSmall organic molecule
Emp. Form.C12H13NO5
Mol. Mass.251.2353
SMILESOC(=O)CCCC(=O)Nc1ccccc1C(O)=O