Reaction Details
TargetComplement C1s subcomponent
LigandBDBM32671
Substrate/Competitorn/a
Meas. Tech.Complement factor C1s IC50 from mixture screen
IC50 880±120 nM
Citation PubChem, PC Complement factor C1s IC50 from mixture screen PubChem Bioassay(2008)[AID]
 
Complement C1s subcomponent
Name:Complement C1s subcomponent
Type:Protein
Mol. Mass.:76657.91
Organism:Homo sapiens (Human)
Description:P09871
Residue:688
BDBM32671
NameBDBM32671
Synonyms:3-(2-furyl)-5-(methylthio)-1-(2-thienylcarbonyl)-1H-1,2,4-triazole SMR000075208 [3-(2-furyl)-5-(methylthio)-1,2,4-triazol-1-yl]-(2-thienyl)methanone [3-(furan-2-yl)-5-methylsulfanyl-1,2,4-triazol-1-yl]-thiophen-2-ylmethanone | cid_976329
TypeSmall organic molecule
Emp. Form.C12H9N3O2S2
Mol. Mass.291.349
SMILESCSc1nc(nn1C(=O)c1cccs1)-c1ccco1