Reaction Details
TargetComplement C1s subcomponent
LigandBDBM40382
Substrate/Competitorn/a
Meas. Tech.Complement factor C1s IC50 from mixture screen
IC50 3830±1900 nM
Citation PubChem, PC Complement factor C1s IC50 from mixture screen PubChem Bioassay(2008)[AID]
 
Complement C1s subcomponent
Name:Complement C1s subcomponent
Type:Protein
Mol. Mass.:76657.91
Organism:Homo sapiens (Human)
Description:P09871
Residue:688
BDBM40382
NameBDBM40382
Synonyms:1-(4,5,6,7-tetrahydro-1-benzothien-3-ylcarbonyl)-1H-pyrazole MLS000065702 cid_1245419 pyrazol-1-yl(4,5,6,7-tetrahydrobenzothiophen-3-yl)methanone
TypeSmall organic molecule
Emp. Form.C12H12N2OS
Mol. Mass.232.301
SMILESO=C(c1csc2CCCCc12)n1cccn1