Reaction Details
TargetDNA-directed RNA polymerase subunit beta
LigandBDBM41199
Substrate/Competitorn/a
Meas. Tech.RNA polymerase dose-response confirmation
IC50>50000±0 nM
Citation PubChem, PC RNA polymerase dose-response confirmation PubChem Bioassay(2008)[AID]
 
DNA-directed RNA polymerase subunit beta
Name:DNA-directed RNA polymerase subunit beta
Synonyms:RNA polymerase beta subunit (EC 2.7.7.6)
Type:Enzyme Catalytic Domain
Mol. Mass.:150595.80
Organism:Escherichia coli
Description:A0A0E2LB94
Residue:1342
BDBM41199
NameBDBM41199
TypeSmall organic molecule
Emp. Form.C17H21NO6
Mol. Mass.335.3517
SMILESCOCCN1C(C(C(C)=O)C(=O)C1=O)c1ccc(OC)c(OC)c1