Reaction Details
TargetDNA-directed RNA polymerase subunit beta
LigandBDBM41200
Substrate/Competitorn/a
Meas. Tech.RNA polymerase dose-response confirmation
IC50 8380.41±454.951 nM
Citation PubChem, PC RNA polymerase dose-response confirmation PubChem Bioassay(2008)[AID]
 
DNA-directed RNA polymerase subunit beta
Name:DNA-directed RNA polymerase subunit beta
Synonyms:RNA polymerase beta subunit (EC 2.7.7.6)
Type:Enzyme Catalytic Domain
Mol. Mass.:150595.80
Organism:Escherichia coli
Description:A0A0E2LB94
Residue:1342
BDBM41200
NameBDBM41200
TypeSmall organic molecule
Emp. Form.C13H12ClN4O
Mol. Mass.275.713
SMILESCc1cc(O)c2[n+](Cc3ccc(Cl)cc3)ncn2n1