Reaction Details
TargetDNA-directed RNA polymerase subunit beta
LigandBDBM41201
Substrate/Competitorn/a
Meas. Tech.RNA polymerase dose-response confirmation
IC50>50000±0 nM
Citation PubChem, PC RNA polymerase dose-response confirmation PubChem Bioassay(2008)[AID]
 
DNA-directed RNA polymerase subunit beta
Name:DNA-directed RNA polymerase subunit beta
Synonyms:RNA polymerase beta subunit (EC 2.7.7.6)
Type:Enzyme Catalytic Domain
Mol. Mass.:150595.80
Organism:Escherichia coli
Description:A0A0E2LB94
Residue:1342
BDBM41201
NameBDBM41201
TypeSmall organic molecule
Emp. Form.C24H26N6O4S
Mol. Mass.494.566
SMILESCCOc1ccc(NCc2nnc(SCC(=O)Nc3cc(C)on3)n2-c2ccc(OC)cc2)cc1