Reaction Details
TargetDNA-directed RNA polymerase subunit beta
LigandBDBM32017
Substrate/Competitorn/a
Meas. Tech.RNA polymerase dose-response confirmation
IC50 23176.1±3735.42 nM
Citation PubChem, PC RNA polymerase dose-response confirmation PubChem Bioassay(2008)[AID]
 
DNA-directed RNA polymerase subunit beta
Name:DNA-directed RNA polymerase subunit beta
Synonyms:RNA polymerase beta subunit (EC 2.7.7.6)
Type:Enzyme Catalytic Domain
Mol. Mass.:150595.80
Organism:Escherichia coli
Description:A0A0E2LB94
Residue:1342
BDBM32017
NameBDBM32017
TypeSmall organic molecule
Emp. Form.C27H29NO10
Mol. Mass.527.5199
SMILESCOc1cccc2C(=O)c3c(O)c4C[C@](O)(C[C@H](O[C@H]5C[C@H](N)[C@H](O)[C@H](C)O5)c4c(O)c3C(=O)c12)C(C)=O