Reaction Details
TargetDNA-directed RNA polymerase subunit beta
LigandBDBM34599
Substrate/Competitorn/a
Meas. Tech.RNA polymerase dose-response confirmation
IC50 26321.7±1394.25 nM
Citation PubChem, PC RNA polymerase dose-response confirmation PubChem Bioassay(2008)[AID]
 
DNA-directed RNA polymerase subunit beta
Name:DNA-directed RNA polymerase subunit beta
Synonyms:RNA polymerase beta subunit (EC 2.7.7.6)
Type:Enzyme Catalytic Domain
Mol. Mass.:150595.80
Organism:Escherichia coli
Description:A0A0E2LB94
Residue:1342
BDBM34599
NameBDBM34599
TypeSmall organic molecule
Emp. Form.C17H15ClF3N5O4
Mol. Mass.445.78
SMILESFC(F)(F)C1(NC(=O)Nc2cc(ncn2)N2CCOCC2)Oc2ccc(Cl)cc2O1