Reaction Details
TargetDNA-directed RNA polymerase subunit beta
LigandBDBM41233
Substrate/Competitorn/a
Meas. Tech.RNA polymerase dose-response confirmation
IC50 23004.8±894.098 nM
Citation PubChem, PC RNA polymerase dose-response confirmation PubChem Bioassay(2008)[AID]
 
DNA-directed RNA polymerase subunit beta
Name:DNA-directed RNA polymerase subunit beta
Synonyms:RNA polymerase beta subunit (EC 2.7.7.6)
Type:Enzyme Catalytic Domain
Mol. Mass.:150595.80
Organism:Escherichia coli
Description:A0A0E2LB94
Residue:1342
BDBM41233
NameBDBM41233
TypeSmall organic molecule
Emp. Form.C13H10F3N3O3S
Mol. Mass.345.297
SMILESCc1csc(NC(=O)NC2(Oc3ccccc3O2)C(F)(F)F)n1