Reaction Details
TargetDNA-directed RNA polymerase subunit beta
LigandBDBM41272
Substrate/Competitorn/a
Meas. Tech.RNA polymerase dose-response confirmation
IC50 31421.2±1187.08 nM
Citation PubChem, PC RNA polymerase dose-response confirmation PubChem Bioassay(2008)[AID]
 
DNA-directed RNA polymerase subunit beta
Name:DNA-directed RNA polymerase subunit beta
Synonyms:RNA polymerase beta subunit (EC 2.7.7.6)
Type:Enzyme Catalytic Domain
Mol. Mass.:150595.80
Organism:Escherichia coli
Description:A0A0E2LB94
Residue:1342
BDBM41272
NameBDBM41272
TypeSmall organic molecule
Emp. Form.C14H14ClNO3S
Mol. Mass.311.784
SMILESCc1c(C)c(NS(=O)(=O)c2ccccc2)cc(Cl)c1O