Reaction Details
TargetPantothenate synthetase
LigandBDBM30881
Substrate/Competitorn/a
Meas. Tech.Mycobacterium tuberculosis Pantothenate Synthetase Secondary Assay
IC50 0.15±n/a nM
Citation PubChem, PC Mycobacterium tuberculosis Pantothenate Synthetase Secondary Assay PubChem Bioassay(2007)[AID]
 
Pantothenate synthetase
Name:Pantothenate synthetase
Type:n/a
Mol. Mass.:32675.10
Organism:Mycobacterium tuberculosis (strain ATCC 25618 / H37Rv)
Description:ChEMBL_102878
Residue:309
BDBM30881
NameBDBM30881
Synonyms:5-tert-butyl-N-[1-(2-methylbenzyl)-1H-pyrazol-4-yl]-4,5,6,7-tetrahydro-1,2-benzisoxazole-3-carboxamide 5-tert-butyl-N-[1-[(2-methylphenyl)methyl]-4-pyrazolyl]-4,5,6,7-tetrahydro-1,2-benzoxazole-3-carboxamide MLS000087418 cid_3243466
TypeSmall organic molecule
Emp. Form.C23H28N4O2
Mol. Mass.392.494
SMILESCc1ccccc1Cn1cc(NC(=O)c2noc3CCC(Cc23)C(C)(C)C)cn1