Reaction Details
TargetP2X purinoceptor 3
LigandBDBM265683
Substrate/Competitorn/a
Meas. Tech.Human P2X3 Receptor Inhibition Assay
pH7.5±n/a
IC50 2.00±n/a nM
Commentsextracted
Citation Kai, HHoriguchi, TAsahi, KFujii, Y Triazine derivative and pharmaceutical composition having an analgesic activity comprising the same US Patent US9718790 Publication Date 8/1/2017
 
P2X purinoceptor 3
Name:P2X purinoceptor 3
Type:Protein
Mol. Mass.:44292.02
Organism:Homo sapiens (Human)
Description:P56373
Residue:397
BDBM265683
NameBDBM265683
Synonyms:US9718790, I-1238
TypeSmall organic molecule
Emp. Form.C28H29N5O5
Mol. Mass.515.5604
SMILESCCOC(=O)CCCn1c(=O)[nH]\c(=N/c2ccc(Oc3ccncc3)cc2)n(Cc2ccc(C)cc2)c1=O