Reaction Details
TargetP2X purinoceptor 3
LigandBDBM266068
Substrate/Competitorn/a
Meas. Tech.Human P2X3 Receptor Inhibition Assay
pH7.5±n/a
IC50 1.000±n/a nM
Commentsextracted
Citation Kai, HHoriguchi, TAsahi, KFujii, Y Triazine derivative and pharmaceutical composition having an analgesic activity comprising the same US Patent US9718790 Publication Date 8/1/2017
 
P2X purinoceptor 3
Name:P2X purinoceptor 3
Type:Protein
Mol. Mass.:44292.02
Organism:Homo sapiens (Human)
Description:P56373
Residue:397
BDBM266068
NameBDBM266068
Synonyms:US9718790, I-2113
TypeSmall organic molecule
Emp. Form.C28H28ClN5O8
Mol. Mass.598.004
SMILESCOC(=O)c1cc(Oc2ccc(cc2)\N=c2/[nH]c(=O)n(CCOC3CCCCO3)c(=O)n2Cc2ccc(Cl)cc2)no1