Reaction Details
TargetP2X purinoceptor 3
LigandBDBM266143
Substrate/Competitorn/a
Meas. Tech.Human P2X3 Receptor Inhibition Assay
pH7.5±n/a
IC50 2.00±n/a nM
Commentsextracted
Citation Kai, HHoriguchi, TAsahi, KFujii, Y Triazine derivative and pharmaceutical composition having an analgesic activity comprising the same US Patent US9718790 Publication Date 8/1/2017
 
P2X purinoceptor 3
Name:P2X purinoceptor 3
Type:Protein
Mol. Mass.:44292.02
Organism:Homo sapiens (Human)
Description:P56373
Residue:397
BDBM266143
NameBDBM266143
Synonyms:US9718790, I-2148
TypeSmall organic molecule
Emp. Form.C24H22ClN5O5S
Mol. Mass.527.98
SMILESCCOC(=O)c1cnc(Oc2ccc(cc2)\N=c2/[nH]c(=O)n(CC)c(=O)n2Cc2ccc(Cl)cc2)s1