Reaction Details
TargetP2X purinoceptor 3
LigandBDBM266232
Substrate/Competitorn/a
Meas. Tech.Human P2X3 Receptor Inhibition Assay
pH7.5±n/a
IC50 2.00±n/a nM
Commentsextracted
Citation Kai, HHoriguchi, TAsahi, KFujii, Y Triazine derivative and pharmaceutical composition having an analgesic activity comprising the same US Patent US9718790 Publication Date 8/1/2017
 
P2X purinoceptor 3
Name:P2X purinoceptor 3
Type:Protein
Mol. Mass.:44292.02
Organism:Homo sapiens (Human)
Description:P56373
Residue:397
BDBM266232
NameBDBM266232
Synonyms:US9718790, I-1432
TypeSmall organic molecule
Emp. Form.C27H27N5O6
Mol. Mass.517.5332
SMILESCOC(=O)[C@@H](C)Cn1c(=O)[nH]\c(=N/c2ccc(Oc3ccnc(O)c3)cc2)n(Cc2ccc(C)cc2)c1=O