Reaction Details
TargetP2X purinoceptor 3
LigandBDBM266378
Substrate/Competitorn/a
Meas. Tech.Human P2X3 Receptor Inhibition Assay
pH7.5±n/a
IC50 2.00±n/a nM
Commentsextracted
Citation Kai, HHoriguchi, TAsahi, KFujii, Y Triazine derivative and pharmaceutical composition having an analgesic activity comprising the same US Patent US9718790 Publication Date 8/1/2017
 
P2X purinoceptor 3
Name:P2X purinoceptor 3
Type:Protein
Mol. Mass.:44292.02
Organism:Homo sapiens (Human)
Description:P56373
Residue:397
BDBM266378
NameBDBM266378
Synonyms:US9718790, I-2230
TypeSmall organic molecule
Emp. Form.C25H21ClN6O3
Mol. Mass.488.926
SMILESCCCn1c(=O)[nH]\c(=N/c2ccc(Oc3ccc(nc3)C#N)cc2)n(Cc2ccc(Cl)cc2)c1=O