Reaction Details
TargetP2X purinoceptor 3
LigandBDBM266577
Substrate/Competitorn/a
Meas. Tech.Human P2X3 Receptor Inhibition Assay
pH7.5±n/a
IC50 2.00±n/a nM
Commentsextracted
Citation Kai, HHoriguchi, TAsahi, KFujii, Y Triazine derivative and pharmaceutical composition having an analgesic activity comprising the same US Patent US9718790 Publication Date 8/1/2017
 
P2X purinoceptor 3
Name:P2X purinoceptor 3
Type:Protein
Mol. Mass.:44292.02
Organism:Homo sapiens (Human)
Description:P56373
Residue:397
BDBM266577
NameBDBM266577
Synonyms:US9718790, I-2309
TypeSmall organic molecule
Emp. Form.C26H23ClN6O4
Mol. Mass.518.952
SMILESCNC(=O)c1cc(Oc2ccc(cc2)\N=c2/[nH]c(=O)n(C3CC3)c(=O)n2Cc2ccc(Cl)cc2)ccn1