Reaction Details
TargetP2X purinoceptor 3
LigandBDBM266653
Substrate/Competitorn/a
Meas. Tech.Human P2X3 Receptor Inhibition Assay
pH7.5±n/a
IC50 2.00±n/a nM
Commentsextracted
Citation Kai, HHoriguchi, TAsahi, KFujii, Y Triazine derivative and pharmaceutical composition having an analgesic activity comprising the same US Patent US9718790 Publication Date 8/1/2017
 
P2X purinoceptor 3
Name:P2X purinoceptor 3
Type:Protein
Mol. Mass.:44292.02
Organism:Homo sapiens (Human)
Description:P56373
Residue:397
BDBM266653
NameBDBM266653
Synonyms:US9718790, I-2387
TypeSmall organic molecule
Emp. Form.C25H21ClN6O4
Mol. Mass.504.925
SMILESCCn1c(=O)[nH]\c(=N/c2ccc(Oc3cccc(n3)C#N)c(OC)c2)n(Cc2ccc(Cl)cc2)c1=O