Reaction Details
TargetP2X purinoceptor 3
LigandBDBM266762
Substrate/Competitorn/a
Meas. Tech.Human P2X3 Receptor Inhibition Assay
pH7.5±n/a
IC50 1.000±n/a nM
Commentsextracted
Citation Kai, HHoriguchi, TAsahi, KFujii, Y Triazine derivative and pharmaceutical composition having an analgesic activity comprising the same US Patent US9718790 Publication Date 8/1/2017
 
P2X purinoceptor 3
Name:P2X purinoceptor 3
Type:Protein
Mol. Mass.:44292.02
Organism:Homo sapiens (Human)
Description:P56373
Residue:397
BDBM266762
NameBDBM266762
Synonyms:US9718790, I-2497
TypeSmall organic molecule
Emp. Form.C25H30N6O4
Mol. Mass.478.5435
SMILESCCn1c(=O)[nH]\c(=N/c2ccc(Oc3cccc(n3)C(N)=O)cc2)n(C[C@H]2CC[C@H](C)CC2)c1=O