Reaction Details
TargetP2X purinoceptor 3
LigandBDBM266938
Substrate/Competitorn/a
Meas. Tech.Human P2X3 Receptor Inhibition Assay
pH7.5±n/a
IC50 2.00±n/a nM
Commentsextracted
Citation Kai, HHoriguchi, TAsahi, KFujii, Y Triazine derivative and pharmaceutical composition having an analgesic activity comprising the same US Patent US9718790 Publication Date 8/1/2017
 
P2X purinoceptor 3
Name:P2X purinoceptor 3
Type:Protein
Mol. Mass.:44292.02
Organism:Homo sapiens (Human)
Description:P56373
Residue:397
BDBM266938
NameBDBM266938
Synonyms:US9718790, I-2684
TypeSmall organic molecule
Emp. Form.C26H23ClN6O6
Mol. Mass.550.95
SMILESCOC(=O)CCn1c(=O)[nH]\c(=N/c2ccc(Oc3cccc(n3)C(N)=O)cc2)n(Cc2ccc(Cl)cc2)c1=O