Reaction Details
TargetP2X purinoceptor 3
LigandBDBM266400
Substrate/Competitorn/a
Meas. Tech.Rat P2X3 Receptor Inhibition Assay
pH7.5±n/a
IC50 19.0±n/a nM
Commentsextracted
Citation Kai, HHoriguchi, TAsahi, KFujii, Y Triazine derivative and pharmaceutical composition having an analgesic activity comprising the same US Patent US9718790 Publication Date 8/1/2017
 
P2X purinoceptor 3
Name:P2X purinoceptor 3
Type:Enzyme Catalytic Domain
Mol. Mass.:44397.63
Organism:RAT
Description:Purinergic, P2X3 0 RAT::P49654
Residue:397
BDBM266400
NameBDBM266400
Synonyms:US9718790, I-0837
TypeSmall organic molecule
Emp. Form.C24H25ClN4O5
Mol. Mass.484.932
SMILESC[C@@H](Cn1c(=O)[nH]\c(=N/c2ccc(OCC3CC3)cc2)n(Cc2ccc(Cl)cc2)c1=O)C(O)=O