Reaction Details
TargetDual specificity protein phosphatase 6
LigandBDBM31754
Substrate/Competitorn/a
Meas. Tech.MKP-3 in vitro secondary assay for identification of irreversible and slow-binding inhibitors
IC50 6900±300 nM
Citation PubChem, PC MKP-3 in vitro secondary assay for identification of irreversible and slow-binding inhibitors PubChem Bioassay(2008)[AID]
 
Dual specificity protein phosphatase 6
Name:Dual specificity protein phosphatase 6
Type:Enzyme
Mol. Mass.:42303.19
Organism:Rattus norvegicus
Description:gi_16758752
Residue:381
BDBM31754
NameBDBM31754
Synonyms:MLS-0010366.0001 N-(5-phenyl-1,2,4-thiadiazol-3-yl)-2-[(5-phenyl-[1,3]thiazolo[2,3-c][1,2,4]triazol-3-yl)sulfanyl]acetamide N-(5-phenyl-1,2,4-thiadiazol-3-yl)-2-[(5-phenylthiazolo[2,3-c][1,2,4]triazol-3-yl)thio]acetamide | cid_1589738
TypeSmall organic molecule
Emp. Form.C20H14N6OS3
Mol. Mass.450.56
SMILESO=C(CSc1nnc2scc(-c3ccccc3)n12)Nc1nsc(n1)-c1ccccc1