Reaction Details
TargetMothers against decapentaplegic homolog 3
LigandBDBM41962
Substrate/Competitorn/a
Meas. Tech.SMAD Transcription Factor Inhibitors Secondary Dose Response Confirmation
IC50 3276.961399±n/a nM
Citation PubChem, PC SMAD Transcription Factor Inhibitors Secondary Dose Response Confirmation PubChem Bioassay(2008)[AID]
 
Mothers against decapentaplegic homolog 3
Name:Mothers against decapentaplegic homolog 3
Type:Enzyme Catalytic Domain
Mol. Mass.:48085.78
Organism:Homo sapiens (Human)
Description:gi_5174513
Residue:425
BDBM41962
NameBDBM41962
Synonyms:2-[(Z)-(3,4-dihydroxyphenyl)-(3-hydroxy-4-keto-cyclohexa-2,5-dien-1-ylidene)methyl]besylic acid 2-[(Z)-(3,4-dihydroxyphenyl)-(3-hydroxy-4-oxocyclohexa-2,5-dien-1-ylidene)methyl]benzenesulfonic acid TG2-222-3 | cid_6150402
TypeSmall organic molecule
Emp. Form.C19H14O7S
Mol. Mass.386.375
SMILESOc1ccc(cc1O)C(=C1CC(=O)C(=O)C=C1)c1ccccc1S(O)(=O)=O