Reaction Details
TargetMothers against decapentaplegic homolog 3
LigandBDBM41977
Substrate/Competitorn/a
Meas. Tech.SMAD Transcription Factor Inhibitors Secondary Dose Response Confirmation
IC50 10341.17256±n/a nM
Citation PubChem, PC SMAD Transcription Factor Inhibitors Secondary Dose Response Confirmation PubChem Bioassay(2008)[AID]
 
Mothers against decapentaplegic homolog 3
Name:Mothers against decapentaplegic homolog 3
Type:Enzyme Catalytic Domain
Mol. Mass.:48085.78
Organism:Homo sapiens (Human)
Description:gi_5174513
Residue:425
BDBM41977
NameBDBM41977
Synonyms:6-[(4-chlorophenyl)-(4-morpholinyl)methyl]-1,3-benzodioxol-5-ol 6-[(4-chlorophenyl)-morpholin-4-ylmethyl]-1,3-benzodioxol-5-ol cid_339909
TypeSmall organic molecule
Emp. Form.C18H18ClNO4
Mol. Mass.347.793
SMILESOc1cc2OCOc2cc1C(N1CCOCC1)c1ccc(Cl)cc1