Reaction Details
TargetBcl-2-related protein A1
LigandBDBM39156
Substrate/Competitorn/a
Meas. Tech.In Vitro Bfl-1 Dose Response Fluorescence Polarization Assay for SAR Study
IC50 556±70 nM
Citation PubChem, PC In Vitro Bfl-1 Dose Response Fluorescence Polarization Assay for SAR Study PubChem Bioassay(2008)[AID]
 
Bcl-2-related protein A1
Name:Bcl-2-related protein A1
Type:Apoptosis regulator protein
Mol. Mass.:19909.74
Organism:Mus musculus (Mouse)
Description:gi_11024684
Residue:172
BDBM39156
NameBDBM39156
Synonyms:3-chloranyl-1-(3,4-dichlorophenyl)-4-[4-(2-hydroxyethyl)piperazin-1-yl]pyrrole-2,5-dione 3-chloro-1-(3,4-dichlorophenyl)-4-[4-(2-hydroxyethyl)-1-piperazinyl]pyrrole-2,5-dione 3-chloro-1-(3,4-dichlorophenyl)-4-[4-(2-hydroxyethyl)piperazino]-3-pyrroline-2,5-quinone MLS-0090874.0001 | cid_16654669
TypeSmall organic molecule
Emp. Form.C16H16Cl3N3O3
Mol. Mass.404.676
SMILESOCCN1CCN(CC1)C1=C(Cl)C(=O)N(C1=O)c1ccc(Cl)c(Cl)c1