Reaction Details
TargetHeat shock 70 kDa protein 1A
LigandBDBM41993
Substrate/Competitorn/a
Meas. Tech.In Vitro Hsp70 Dose Response Fluorescence Polarization Assay for SAR Study
IC50 1970±170 nM
Citation PubChem, PC In Vitro Hsp70 Dose Response Fluorescence Polarization Assay for SAR Study PubChem Bioassay(2008)[AID]
 
Heat shock 70 kDa protein 1A
Name:Heat shock 70 kDa protein 1A
Type:ATP-binding protein
Mol. Mass.:51937.99
Organism:Homo sapiens (Human)
Description:gi_123271505; GST-tagged ATPase domain
Residue:476
BDBM41993
NameBDBM41993
Synonyms:8-sulfamoyl-3a,4,5,9b-tetrahydro-3H-cyclopenta[c]quinoline-4-carboxylic acid cid_2868734
TypeSmall organic molecule
Emp. Form.C13H14N2O4S
Mol. Mass.294.326
SMILESNS(=O)(=O)c1ccc2NC(C3CC=CC3c2c1)C(O)=O