Reaction Details
TargetHeat shock 70 kDa protein 1A
LigandBDBM31747
Substrate/Competitorn/a
Meas. Tech.In Vitro Hsp70 Dose Response Fluorescence Polarization Assay for SAR Study
IC50 10400±1120 nM
Citation PubChem, PC In Vitro Hsp70 Dose Response Fluorescence Polarization Assay for SAR Study PubChem Bioassay(2008)[AID]
 
Heat shock 70 kDa protein 1A
Name:Heat shock 70 kDa protein 1A
Type:ATP-binding protein
Mol. Mass.:51937.99
Organism:Homo sapiens (Human)
Description:gi_123271505; GST-tagged ATPase domain
Residue:476
BDBM31747
NameBDBM31747
Synonyms:6-aminocarbonyl-3a,4,5,9b-tetrahydro-3H-cyclopenta[c]quinoline-4-carboxylic acid MLS-0111539.0001 | cid_2869196
TypeSmall organic molecule
Emp. Form.C14H14N2O3
Mol. Mass.258.2726
SMILESNC(=O)c1cccc2C3C=CCC3C(Nc12)C(O)=O