Reaction Details
TargetHeat shock 70 kDa protein 1A
LigandBDBM29615
Substrate/Competitorn/a
Meas. Tech.In Vitro Hsp70 Dose Response Fluorescence Polarization Assay for SAR Study
IC50 6260±410 nM
Citation PubChem, PC In Vitro Hsp70 Dose Response Fluorescence Polarization Assay for SAR Study PubChem Bioassay(2008)[AID]
 
Heat shock 70 kDa protein 1A
Name:Heat shock 70 kDa protein 1A
Type:ATP-binding protein
Mol. Mass.:51937.99
Organism:Homo sapiens (Human)
Description:gi_123271505; GST-tagged ATPase domain
Residue:476
BDBM29615
NameBDBM29615
Synonyms:6-methoxy-3a,4,5,9b-tetrahydro-3H-cyclopenta[c]quinoline-4-carboxylic acid SMR000009698 cid_652912
TypeSmall organic molecule
Emp. Form.C14H15NO3
Mol. Mass.245.2738
SMILESCOc1cccc2C3C=CCC3C(Nc12)C(O)=O