Reaction Details
TargetHeat shock 70 kDa protein 1A
LigandBDBM50246208
Substrate/Competitorn/a
Meas. Tech.In Vitro Hsp70 Dose Response Fluorescence Polarization Assay for SAR Study
IC50 9850±1340 nM
Citation PubChem, PC In Vitro Hsp70 Dose Response Fluorescence Polarization Assay for SAR Study PubChem Bioassay(2008)[AID]
 
Heat shock 70 kDa protein 1A
Name:Heat shock 70 kDa protein 1A
Type:ATP-binding protein
Mol. Mass.:51937.99
Organism:Homo sapiens (Human)
Description:gi_123271505; GST-tagged ATPase domain
Residue:476
BDBM50246208
NameBDBM50246208
Synonyms:2-(3,4,5-trihydroxy-6-oxo-6H-xanthen-9-yl)cyclohexanecarboxylic acid cid_274122
TypeSmall organic molecule
Emp. Form.C20H18O7
Mol. Mass.370.3527
SMILESOC(=O)C1CCCCC1c1c2ccc(O)c(O)c2oc2c(O)c(=O)ccc12