Reaction Details
TargetLysosomal acid glucosylceramidase
LigandBDBM42269
Substrate/Competitorn/a
Meas. Tech.Dose response cell-based high throughput screening assay to identify enhancers of beta-glucosidase activity
EC50>50000±n/a nM
Citation PubChem, PC Dose response cell-based high throughput screening assay to identify enhancers of beta-glucosidase activity PubChem Bioassay(2008)[AID]
 
Lysosomal acid glucosylceramidase
Name:Lysosomal acid glucosylceramidase
Type:Enzyme
Mol. Mass.:59724.64
Organism:Homo sapiens (Human)
Description:The beta-Glu activity was measured with commercially available beta-glucocerebrosidase (Ceredase) as the enzyme source.
Residue:536
BDBM42269
NameBDBM42269
Synonyms:(8-Fluoro-5H-[1,2,4]triazino[5,6-b]indol-3-ylsulfanyl)-acetic acid benzyl ester 2-[(8-fluoro-5H-[1,2,4]triazin[5,6-b]indol-3-yl)thio]acetic acid benzyl ester MLS000072691 benzyl 2-[(8-fluoro-5H-[1,2,4]triazino[5,6-b]indol-3-yl)sulfanyl]acetate | cid_6398898
TypeSmall organic molecule
Emp. Form.C18H13FN4O2S
Mol. Mass.368.385
SMILESFc1ccc2[nH]c3nc(SCC(=O)OCc4ccccc4)nnc3c2c1