Reaction Details
TargetLysosomal acid glucosylceramidase
LigandBDBM36953
Substrate/Competitorn/a
Meas. Tech.Dose response cell-based high throughput screening assay to identify enhancers of beta-glucosidase activity
EC50>10000±n/a nM
Citation PubChem, PC Dose response cell-based high throughput screening assay to identify enhancers of beta-glucosidase activity PubChem Bioassay(2008)[AID]
 
Lysosomal acid glucosylceramidase
Name:Lysosomal acid glucosylceramidase
Type:Enzyme
Mol. Mass.:59724.64
Organism:Homo sapiens (Human)
Description:The beta-Glu activity was measured with commercially available beta-glucocerebrosidase (Ceredase) as the enzyme source.
Residue:536
BDBM36953
NameBDBM36953
Synonyms:3-(3,4-diethoxyphenyl)-5-(4-pyridyl)-1,2,4-oxadiazole MLS000042464 US10544136, Compound 257 | cid_666359
TypeSmall organic molecule
Emp. Form.C17H17N3O3
Mol. Mass.311.3352
SMILESCCOc1ccc(cc1OCC)-c1noc(n1)-c1ccncc1