Reaction Details
TargetLysosomal acid glucosylceramidase
LigandBDBM42327
Substrate/Competitorn/a
Meas. Tech.Dose response cell-based high throughput screening assay to identify enhancers of beta-glucosidase activity
EC50>10000±n/a nM
Citation PubChem, PC Dose response cell-based high throughput screening assay to identify enhancers of beta-glucosidase activity PubChem Bioassay(2008)[AID]
 
Lysosomal acid glucosylceramidase
Name:Lysosomal acid glucosylceramidase
Type:Enzyme
Mol. Mass.:59724.64
Organism:Homo sapiens (Human)
Description:The beta-Glu activity was measured with commercially available beta-glucocerebrosidase (Ceredase) as the enzyme source.
Residue:536
BDBM42327
NameBDBM42327
Synonyms:4-[cyclohexyl(methyl)sulfamoyl]-N-[5-(methoxymethyl)-1,3,4-oxadiazol-2-yl]benzamide MLS000086355 cid_2051224
TypeSmall organic molecule
Emp. Form.C18H24N4O5S
Mol. Mass.408.472
SMILESCOCc1nnc(NC(=O)c2ccc(cc2)S(=O)(=O)N(C)C2CCCCC2)o1