Reaction Details
TargetLysosomal acid glucosylceramidase
LigandBDBM42394
Substrate/Competitorn/a
Meas. Tech.Dose response cell-based high throughput screening assay to identify enhancers of beta-glucosidase activity
EC50>10000±n/a nM
Citation PubChem, PC Dose response cell-based high throughput screening assay to identify enhancers of beta-glucosidase activity PubChem Bioassay(2008)[AID]
 
Lysosomal acid glucosylceramidase
Name:Lysosomal acid glucosylceramidase
Type:Enzyme
Mol. Mass.:59724.64
Organism:Homo sapiens (Human)
Description:The beta-Glu activity was measured with commercially available beta-glucocerebrosidase (Ceredase) as the enzyme source.
Residue:536
BDBM42394
NameBDBM42394
Synonyms:5-(1-methoxy-1-oxopropan-2-yl)oxy-1,2-dimethyl-3-indolecarboxylic acid ethyl ester MLS000061959 cid_2892134 ethyl 5-(1-methoxy-1-oxopropan-2-yl)oxy-1,2-dimethylindole-3-carboxylate | ethyl 5-(2-methoxy-1-methyl-2-oxoethoxy)-1,2-dimethyl-1H-indole-3-carboxylate
TypeSmall organic molecule
Emp. Form.C17H21NO5
Mol. Mass.319.3523
SMILESCCOC(=O)c1c(C)n(C)c2ccc(OC(C)C(=O)OC)cc12