Reaction Details
TargetLysosomal acid glucosylceramidase
LigandBDBM42405
Substrate/Competitorn/a
Meas. Tech.Dose response cell-based high throughput screening assay to identify enhancers of beta-glucosidase activity
EC50 1665±n/a nM
Citation PubChem, PC Dose response cell-based high throughput screening assay to identify enhancers of beta-glucosidase activity PubChem Bioassay(2008)[AID]
 
Lysosomal acid glucosylceramidase
Name:Lysosomal acid glucosylceramidase
Type:Enzyme
Mol. Mass.:59724.64
Organism:Homo sapiens (Human)
Description:The beta-Glu activity was measured with commercially available beta-glucocerebrosidase (Ceredase) as the enzyme source.
Residue:536
BDBM42405
NameBDBM42405
Synonyms:MLS000110376 N-(2-piperazinoacenaphthen-1-yl)benzenesulfonamide SMR000106306 | cid_2898054
TypeSmall organic molecule
Emp. Form.C22H23N3O2S
Mol. Mass.393.502
SMILESO=S(=O)(NC1C(N2CCNCC2)c2cccc3cccc1c23)c1ccccc1