Reaction Details
TargetNuclear receptor coactivator 1
LigandBDBM43004
Substrate/Competitorn/a
Meas. Tech.Dose response biochemical High Throughput Screening assay for agonists of the steroid receptor coactivator 1 (SRC-1) recruitment by the peroxisome proliferator-activated receptor gamma (PPARgamma)
EC50 24900±n/a nM
Citation PubChem, PC Dose response biochemical High Throughput Screening assay for agonists of the steroid receptor coactivator 1 (SRC-1) recruitment by the peroxisome proliferator-activated receptor gamma (PPARgamma) PubChem Bioassay(2008)[AID]
 
Nuclear receptor coactivator 1
Name:Nuclear receptor coactivator 1
Type:PROTEIN
Mol. Mass.:156749.34
Organism:Homo sapiens (Human)
Description:ChEMBL_759690
Residue:1441
BDBM43004
NameBDBM43004
Synonyms:2-[[5-(4-ketocyclohexa-2,5-dien-1-ylidene)-3-isoxazoline-3-carbonyl]amino]benzoic acid methyl ester MLS000522877 cid_9551347 methyl 2-[[5-(4-oxocyclohexa-2,5-dien-1-ylidene)-2H-1,2-oxazole-3-carbonyl]amino]benzoate
TypeSmall organic molecule
Emp. Form.C18H14N2O5
Mol. Mass.338.3142
SMILESCOC(=O)c1ccccc1NC(=O)c1cc(on1)-c1ccc(O)cc1