Reaction Details
TargetNuclear receptor coactivator 1
LigandBDBM43045
Substrate/Competitorn/a
Meas. Tech.Dose response biochemical High Throughput Screening assay for agonists of the steroid receptor coactivator 1 (SRC-1) recruitment by the peroxisome proliferator-activated receptor gamma (PPARgamma)
EC50 10960±n/a nM
Citation PubChem, PC Dose response biochemical High Throughput Screening assay for agonists of the steroid receptor coactivator 1 (SRC-1) recruitment by the peroxisome proliferator-activated receptor gamma (PPARgamma) PubChem Bioassay(2008)[AID]
 
Nuclear receptor coactivator 1
Name:Nuclear receptor coactivator 1
Type:PROTEIN
Mol. Mass.:156749.34
Organism:Homo sapiens (Human)
Description:ChEMBL_759690
Residue:1441
BDBM43045
NameBDBM43045
Synonyms:10-methoxy-5H-[1]benzothiolo[2,3-c]quinolin-6-one 10-methoxy[1]benzothieno[2,3-c]quinolin-6(5H)-one SMR000162291 | cid_1779937
TypeSmall organic molecule
Emp. Form.C16H11NO2S
Mol. Mass.281.329
SMILESCOc1ccc2sc3c(c2c1)c1ccccc1[nH]c3=O