Reaction Details
TargetDNA-directed RNA polymerase subunit beta
LigandBDBM43308
Substrate/Competitorn/a
Meas. Tech.RNA polymerase SAR
IC50 41441±n/a nM
Citation PubChem, PC RNA polymerase SAR PubChem Bioassay(2008)[AID]
 
DNA-directed RNA polymerase subunit beta
Name:DNA-directed RNA polymerase subunit beta
Synonyms:RNA polymerase beta subunit (EC 2.7.7.6)
Type:Enzyme Catalytic Domain
Mol. Mass.:150595.80
Organism:Escherichia coli
Description:A0A0E2LB94
Residue:1342
BDBM43308
NameBDBM43308
TypeSmall organic molecule
Emp. Form.C20H15NO3S
Mol. Mass.349.403
SMILESOc1ccc(NS(=O)(=O)c2cccc3ccccc23)c2ccccc12