Reaction Details
TargetE3 ubiquitin-protein ligase Mdm2
LigandBDBM43391
Substrate/Competitorn/a
Meas. Tech.E3 Ligase dose-response_384
EC50 160±n/a nM
Citation PubChem, PC E3 Ligase dose-response_384 PubChem Bioassay(2008)[AID]
 
E3 ubiquitin-protein ligase Mdm2
Name:E3 ubiquitin-protein ligase Mdm2
Type:Oncoprotein
Mol. Mass.:55196.54
Organism:Homo sapiens (Human)
Description:Q00987
Residue:491
BDBM43391
NameBDBM43391
Synonyms:3-[(2,4-dichlorophenoxy)methyl]-N-methyl-N-phenyl-benzamide 3-[[2,4-bis(chloranyl)phenoxy]methyl]-N-methyl-N-phenyl-benzamide SMR000198524 | cid_2165997
TypeSmall organic molecule
Emp. Form.C21H17Cl2NO2
Mol. Mass.386.271
SMILESCN(C(=O)c1cccc(COc2ccc(Cl)cc2Cl)c1)c1ccccc1