Reaction Details
TargetE3 ubiquitin-protein ligase Mdm2
LigandBDBM43394
Substrate/Competitorn/a
Meas. Tech.E3 Ligase dose-response_384
EC50 90±n/a nM
Citation PubChem, PC E3 Ligase dose-response_384 PubChem Bioassay(2008)[AID]
 
E3 ubiquitin-protein ligase Mdm2
Name:E3 ubiquitin-protein ligase Mdm2
Type:Oncoprotein
Mol. Mass.:55196.54
Organism:Homo sapiens (Human)
Description:Q00987
Residue:491
BDBM43394
NameBDBM43394
Synonyms:4-Methyl-N-{5-[1-(1-methyl-1H-pyrrol-2-yl)-meth-(Z)-ylidene]-4-oxo-2-thioxo-thiazolidin-3-yl}-benzamide 4-methyl-N-[(5Z)-5-[(1-methylpyrrol-2-yl)methylidene]-4-oxidanylidene-2-sulfanylidene-1,3-thiazolidin-3-yl]benzamide MLS000580916 SMR000220301 | cid_6511938
TypeSmall organic molecule
Emp. Form.C17H15N3O2S2
Mol. Mass.357.45
SMILESCc1ccc(cc1)C(=O)NN1C(=S)S\C(=C/c2cccn2C)C1=O