Reaction Details
TargetE3 ubiquitin-protein ligase Mdm2
LigandBDBM43451
Substrate/Competitorn/a
Meas. Tech.E3 Ligase dose-response_384
EC50 290±n/a nM
Citation PubChem, PC E3 Ligase dose-response_384 PubChem Bioassay(2008)[AID]
 
E3 ubiquitin-protein ligase Mdm2
Name:E3 ubiquitin-protein ligase Mdm2
Type:Oncoprotein
Mol. Mass.:55196.54
Organism:Homo sapiens (Human)
Description:Q00987
Residue:491
BDBM43451
NameBDBM43451
Synonyms:4-(diacetylamino)-3-phenyl-2-sulfanylidene-5-thiazolecarboxylic acid ethyl ester MLS000693671 cid_3100036 ethyl 4-(diethanoylamino)-3-phenyl-2-sulfanylidene-1,3-thiazole-5-carboxylate
TypeSmall organic molecule
Emp. Form.C16H16N2O4S2
Mol. Mass.364.439
SMILESCCOC(=O)c1sc(=S)n(c1N(C(C)=O)C(C)=O)-c1ccccc1