Reaction Details
TargetE3 ubiquitin-protein ligase Mdm2
LigandBDBM43463
Substrate/Competitorn/a
Meas. Tech.E3 Ligase dose-response_384
EC50 560±n/a nM
Citation PubChem, PC E3 Ligase dose-response_384 PubChem Bioassay(2008)[AID]
 
E3 ubiquitin-protein ligase Mdm2
Name:E3 ubiquitin-protein ligase Mdm2
Type:Oncoprotein
Mol. Mass.:55196.54
Organism:Homo sapiens (Human)
Description:Q00987
Residue:491
BDBM43463
NameBDBM43463
Synonyms:(Z)-2,3-bis(chloranyl)-3-[(4-methoxyphenyl)methylsulfinyl]-N-(6-methoxypyridin-3-yl)prop-2-enamide (Z)-2,3-dichloro-3-[(4-methoxyphenyl)methylsulfinyl]-N-(6-methoxypyridin-3-yl)prop-2-enamide 2,3-dichloro-3-[(4-methoxybenzyl)sulfinyl]-N-(6-methoxy-3-pyridinyl)acrylamide SMR000334341 | cid_1472222
TypeSmall organic molecule
Emp. Form.C17H16Cl2N2O4S
Mol. Mass.415.291
SMILESCOc1ccc(CS(=O)C(Cl)=C(Cl)C(=O)Nc2ccc(OC)nc2)cc1