Reaction Details
TargetE3 ubiquitin-protein ligase Mdm2
LigandBDBM43465
Substrate/Competitorn/a
Meas. Tech.E3 Ligase dose-response_384
EC50 620±n/a nM
Citation PubChem, PC E3 Ligase dose-response_384 PubChem Bioassay(2008)[AID]
 
E3 ubiquitin-protein ligase Mdm2
Name:E3 ubiquitin-protein ligase Mdm2
Type:Oncoprotein
Mol. Mass.:55196.54
Organism:Homo sapiens (Human)
Description:Q00987
Residue:491
BDBM43465
NameBDBM43465
Synonyms:(Z)-2,3-bis(chloranyl)-3-[(4-chlorophenyl)methylsulfinyl]-N-(6-methoxypyridin-3-yl)prop-2-enamide (Z)-2,3-dichloro-3-[(4-chlorophenyl)methylsulfinyl]-N-(6-methoxy-3-pyridinyl)-2-propenamide 2,3-dichloro-3-[(4-chlorobenzyl)sulfinyl]-N-(6-methoxy-3-pyridinyl)acrylamide SMR000334340 | cid_1472220
TypeSmall organic molecule
Emp. Form.C16H13Cl3N2O3S
Mol. Mass.419.71
SMILESCOc1ccc(NC(=O)C(Cl)=C(Cl)S(=O)Cc2ccc(Cl)cc2)cn1