Reaction Details
TargetE3 ubiquitin-protein ligase Mdm2
LigandBDBM43474
Substrate/Competitorn/a
Meas. Tech.E3 Ligase dose-response_384
EC50 380±n/a nM
Citation PubChem, PC E3 Ligase dose-response_384 PubChem Bioassay(2008)[AID]
 
E3 ubiquitin-protein ligase Mdm2
Name:E3 ubiquitin-protein ligase Mdm2
Type:Oncoprotein
Mol. Mass.:55196.54
Organism:Homo sapiens (Human)
Description:Q00987
Residue:491
BDBM43474
NameBDBM43474
Synonyms:(3Z,5E)-1-ethyl-3,5-bis(3-hydroxy-4-methoxy-benzylidene)-4-piperidone (3Z,5E)-1-ethyl-3,5-bis[(3-hydroxy-4-methoxyphenyl)methylidene]piperidin-4-one MLS000775870 cid_2376815
TypeSmall organic molecule
Emp. Form.C23H25NO5
Mol. Mass.395.4483
SMILESCCN1C\C(=C\c2ccc(OC)c(O)c2)C(=O)\C(C1)=C\c1ccc(OC)c(O)c1