Reaction Details
TargetE3 ubiquitin-protein ligase Mdm2
LigandBDBM43478
Substrate/Competitorn/a
Meas. Tech.E3 Ligase dose-response_384
EC50 260±n/a nM
Citation PubChem, PC E3 Ligase dose-response_384 PubChem Bioassay(2008)[AID]
 
E3 ubiquitin-protein ligase Mdm2
Name:E3 ubiquitin-protein ligase Mdm2
Type:Oncoprotein
Mol. Mass.:55196.54
Organism:Homo sapiens (Human)
Description:Q00987
Residue:491
BDBM43478
NameBDBM43478
Synonyms:1,2,4-Dithiazol-3-amine, 5-[(2-furanyl)methylimino]- N, N-dimethyl-, monohydrobromide 5-(furan-2-ylmethylimino)-N,N-dimethyl-1,2,4-dithiazol-3-amine;hydrobromide SMR000529050 cid_360474
TypeSmall organic molecule
Emp. Form.C9H11N3OS2
Mol. Mass.241.333
SMILESCN(C)c1n\c(=N\Cc2ccco2)ss1