Reaction Details
TargetG2/mitotic-specific cyclin-B1
LigandBDBM38959
Substrate/Competitorn/a
Meas. Tech.Counterscreen assay for inhibitors of Wee1 degradation: dose response cell-based assay to identify inhibitors of cyclin B degradation
EC50>49750±n/a nM
Citation PubChem, PC Counterscreen assay for inhibitors of Wee1 degradation: dose response cell-based assay to identify inhibitors of cyclin B degradation PubChem Bioassay(2008)[AID]
 
G2/mitotic-specific cyclin-B1
Name:G2/mitotic-specific cyclin-B1
Type:Enzyme Subunit
Mol. Mass.:48340.95
Organism:Homo sapiens (Human)
Description:P14635
Residue:433
BDBM38959
NameBDBM38959
Synonyms:4-(1-methyl-2-oxidanylidene-quinolin-4-yl)oxy-N-(4-methylpyridin-2-yl)butanamide 4-[(1-methyl-2-oxo-1,2-dihydroquinolin-4-yl)oxy]-N-(4-methylpyridin-2-yl)butanamide 4-[(2-keto-1-methyl-4-quinolyl)oxy]-N-(4-methyl-2-pyridyl)butyramide SMR000027929 | cid_3237904
TypeSmall organic molecule
Emp. Form.C20H21N3O3
Mol. Mass.351.399
SMILESCc1ccnc(NC(=O)CCCOc2cc(=O)n(C)c3ccccc23)c1