Reaction Details
TargetG2/mitotic-specific cyclin-B1
LigandBDBM43755
Substrate/Competitorn/a
Meas. Tech.Counterscreen assay for inhibitors of Wee1 degradation: dose response cell-based assay to identify inhibitors of cyclin B degradation
EC50>49750±n/a nM
Citation PubChem, PC Counterscreen assay for inhibitors of Wee1 degradation: dose response cell-based assay to identify inhibitors of cyclin B degradation PubChem Bioassay(2008)[AID]
 
G2/mitotic-specific cyclin-B1
Name:G2/mitotic-specific cyclin-B1
Type:Enzyme Subunit
Mol. Mass.:48340.95
Organism:Homo sapiens (Human)
Description:P14635
Residue:433
BDBM43755
NameBDBM43755
Synonyms:3-hydroxy-7-phenyl-pyrrolo[3,2-e][2,1,3]benzoxadiazole 3-oxidanyl-7-phenyl-pyrrolo[3,2-e][2,1,3]benzoxadiazole MLS000061388 cid_690911
TypeSmall organic molecule
Emp. Form.C14H9N3O2
Mol. Mass.251.2402
SMILESOn1onc2c1ccc1nc(cc21)-c1ccccc1